{"text_format":"1","workbook":"xlsx","n_sheets":3,"sheets":["גיליון1","גיליון2","גיליון3"],"not_rendered":{"charts":0,"images":1,"macros":0,"external_links":1,"defined_names":0,"comments":0,"pivot_tables":0},"unopened":[],"bounds":{"document_bytes":16777216,"sheet_cells":100000,"rows_first":2000,"rows_last":500,"rows_between":2000,"halvings":0,"cell_chars":16384,"cell_head_chars":4096},"cells_cut":0,"cells_raw":0,"read":"whole","date_system":"1900"}

{"sheet":"גיליון1","index":0,"n_rows":542,"n_cols":85,"rows_kept":542,"cut":false,"hidden":false,"merged":[[0,1,0,43],[6,9,9,9],[5,0,5,16383],[2,7,2,13],[2,0,2,6],[1,11,1,33],[1,0,1,10]]}
["V2.01","הראל חברה לביטוח בע\"מ",null,null,null,null,null,null,null,null,null,null,null,null,null,null,null,null,null,null,null,null,null,null,null,null,null,null,null,null,null,null,null,null,null,null,null,null,null,null,null,null,null,null,null,null,null,null,null,null,null,null,null,"'נספחים ב וג'!$",null,null,null,null,null,null,null,null,null,null,null,null,null,null,null,null,null,null,null,null,null,null,null,null,null,null,null,null,null,null,"לא קיים מידע נוסף בשורה זו. המשך בשורה הבאה."]
["דו\"ח חודשי , שיעורי ההשקעות ורכוש קבוע מסך כל ההתחייבויות לתקופה שנסתיימה ביום - ",null,null,null,null,null,null,null,null,null,null,"31.8.22",null,null,null,null,null,null,null,null,null,null,null,null,null,null,null,null,null,null,null,null,null,null,50,51,52,53,54,55,56,57,58,59,60,61,62,63,64,65,66,67,68,69,70,71,72,73,74,75,76,77,78,79,80,81,82,83,84,85,86,87,88,89,90,91,92,93,94,95,96,97,98,99,"לא קיים מידע נוסף בשורה זו. המשך בשורה הבאה."]
[" הסכומים באלפי ש\"ח ",null,null,null,null,null,null,"",null,null,null,null,null,null,1,2,3,4,5,6,7,8,9,10,11,12,13,14,15,16,17,18,19,20,21,22,23,24,25,26,27,28,29,30,31,32,33,34,35,36,37,38,39,40,41,42,43,44,45,46,47,48,49,50,51,52,53,54,55,56,57,58,59,60,61,62,63,64,65,66,67,68,69,70,"לא קיים מידע נוסף בשורה זו. המשך בשורה הבאה."]
[]
[]
["גיליון זה הוא הגיליון היחיד בקובץ זה. גבולות הגיליון הםן טור CG  ושורה 496. גיליון זה מכיל טבלה המתחילה בתא A7 ומסתיימת בתא CG496. שורות 7 עד 10 מכילות את כותרות הטבלה. קיימים תאים ריקים בטבלה."]
[null,null,null,null,null,null,null,null,null,"סה\"כ משתתף ברווחים","ביטוח חיים "]
[null,null,null,null,null,null,null,null,null,null,10,11,12,13]
[null,null,null,null,null,null,null,null,"חזרה",null,{"$f":"'[1]נספחים ב וג'!$B$10","v":"קרן ח'"},{"$f":"'[1]נספחים ב וג'!$B$11","v":"קרן ט'"},{"$f":"'[1]נספחים ב וג'!$B$12","v":"קרן י'"},{"$f":"'[1]נספחים ב וג'!$B$13","v":"קרן י' פוליסות שהונפקו לאחר 1.1.04"},{"$f":"'[1]נספחים ב וג'!$C$30","v":"הראל-מסלול כללי"},{"$f":"'[1]נספחים ב וג'!$C$31","v":"הראל-מסלול אג\"ח ללא מניות"},{"$f":"'[1]נספחים ב וג'!$C$32","v":"הראל-מסלול אג\"ח עד 20% במניות"},{"$f":"'[1]נספחים ב וג'!$C$33","v":"הראל-מסלול אג\"ח עד 10% במניות"},{"$f":"'[1]נספחים ב וג'!$C$34","v":"הראל-מסלול מניות"},{"$f":"'[1]נספחים ב וג'!$C$35","v":"הראל-מסלול שקלי טווח קצר"},{"$f":"'[1]נספחים ב וג'!$C$36","v":"הראל-מסלול חו\"ל"},{"$f":"'[1]נספחים ב וג'!$C$37","v":"הראל - מסלול אג\"ח מדינת ישראל"},{"$f":"'[1]נספחים ב וג'!$C$38","v":"הראל - מסלול אג\"ח קונצרני"},{"$f":"'[1]נספחים ב וג'!$C$39","v":"הראל-מסלול משתתף ברווחים שקלי טווח קצר"},{"$f":"'[1]נספחים ב וג'!$C$40","v":"הראל-מסלול משתתף ברווחים כללי ללא מניות"},{"$f":"'[1]נספחים ב וג'!$C$41","v":"הראל-מסלול משתתף ברווחים לפחות 75% מניות"},{"$f":"'[1]נספחים ב וג'!$C$42","v":"הראל- אג\"ח חו\"ל"},{"$f":"'[1]נספחים ב וג'!$C$43","v":"הראל-מסלול פאסיבי - כללי"},{"$f":"'[1]נספחים ב וג'!$C$44","v":"הראל-מסלול לבני 50 ומטה"},{"$f":"'[1]נספחים ב וג'!$C$45","v":"הראל-מסלול לבני 50 עד 60"},{"$f":"'[1]נספחים ב וג'!$C$46","v":"הראל-מסלול לבני 60 ומעלה"},{"$f":"'[1]נספחים ב וג'!$C$47","v":"הראל-מסלול בסיסי למקבלי קצבה"},{"$f":"'[1]נספחים ב וג'!$C$48","v":"הראל-מסלול אג\"ח עד 20% במניות למקבלי קצבה"},{"$f":"'[1]נספחים ב וג'!$C$49","v":"הראל חברה לביטוח בע\"מ מדרגות עד 50"},"הראל מסלול לגילאי 50 עד 60 ","הראל מסלול לגילאי 60 ומעלה","הראל מסלול בסיסי למקבלי קצבה","הראל מסלול אג\"ח עד 20% במניות למקבלי קצבה","הראל מסלול הוני ללא אג\"ח","הראל מחקה מדד ממשלתי שקלי ריבית קבועה","הראל מחקה מדד S&P 500","הראל מחקה מדד ממשלתי צמוד 5-10","הראל מחקה מדד תל בונד 60","הראל מחקה מדד ת\"א 35",{"$f":"INDIRECT(CONCATENATE($BB$1,\"C$\",AS$2))","v":{"$error":"#REF!"}},{"$error":"#REF!"},{"$error":"#REF!"},{"$error":"#REF!"},{"$error":"#REF!"},{"$error":"#REF!"},{"$error":"#REF!"},{"$error":"#REF!"},{"$error":"#REF!"},{"$f":"INDIRECT(CONCATENATE($BB$1,\"C$\",BB$2))","v":{"$error":"#REF!"}},{"$f":"INDIRECT(CONCATENATE($BB$1,\"C$\",BC$2))","v":{"$error":"#REF!"}},{"$error":"#REF!"},{"$error":"#REF!"},{"$error":"#REF!"},{"$error":"#REF!"},{"$error":"#REF!"},{"$error":"#REF!"},{"$error":"#REF!"},{"$error":"#REF!"},{"$error":"#REF!"},{"$error":"#REF!"},{"$error":"#REF!"},{"$error":"#REF!"},{"$error":"#REF!"},{"$error":"#REF!"},{"$error":"#REF!"},{"$error":"#REF!"},{"$error":"#REF!"},{"$error":"#REF!"},{"$error":"#REF!"},{"$error":"#REF!"},{"$error":"#REF!"},{"$error":"#REF!"},{"$error":"#REF!"},{"$error":"#REF!"},{"$error":"#REF!"},{"$error":"#REF!"},{"$error":"#REF!"},{"$error":"#REF!"},{"$error":"#REF!"},"אחר"]
["שורה",null,null,null,null,null,null,null,null,null,{"$f":"IF('[1]נספחים ב וג'!$N$10=0,0,CONCATENATE(VLOOKUP($B$1,[1]הערות!$D$89:$F$111,3,0),\"0\",K8))","v":"0010"},{"$f":"IF('[1]נספחים ב וג'!$N$11=0,0,CONCATENATE(VLOOKUP($B$1,[1]הערות!$D$89:$F$111,3,0),\"0\",L8))","v":"0011"},{"$f":"IF('[1]נספחים ב וג'!$N$12=0,0,CONCATENATE(VLOOKUP($B$1,[1]הערות!$D$89:$F$111,3,0),\"0\",M8))","v":"0012"},{"$f":"IF('[1]נספחים ב וג'!$N$13=0,0,CONCATENATE(VLOOKUP($B$1,[1]הערות!$D$89:$F$111,3,0),\"0\",N8))","v":"0013"},{"$f":"'[1]נספחים ב וג'!$B$30","v":88},{"$f":"'[1]נספחים ב וג'!$B$31","v":89},{"$f":"'[1]נספחים ב וג'!$B$32","v":90},{"$f":"'[1]נספחים ב וג'!$B$33","v":91},{"$f":"'[1]נספחים ב וג'!$B$34","v":92},{"$f":"'[1]נספחים ב וג'!$B$35","v":93},{"$f":"'[1]נספחים ב וג'!$B$36","v":163},{"$f":"'[1]נספחים ב וג'!$B$37","v":177},{"$f":"'[1]נספחים ב וג'!$B$38","v":178},{"$f":"'[1]נספחים ב וג'!$B$39","v":195},{"$f":"'[1]נספחים ב וג'!$B$40","v":196},{"$f":"'[1]נספחים ב וג'!$B$41","v":197},{"$f":"'[1]נספחים ב וג'!$B$42","v":8592},{"$f":"'[1]נספחים ב וג'!$B$43","v":9561},{"$f":"'[1]נספחים ב וג'!$B$44","v":9562},{"$f":"'[1]נספחים ב וג'!$B$45","v":9563},{"$f":"'[1]נספחים ב וג'!$B$46","v":9564},{"$f":"'[1]נספחים ב וג'!$B$47","v":9565},{"$f":"'[1]נספחים ב וג'!$B$48","v":9566},{"$f":"'[1]נספחים ב וג'!$B$49","v":11400},11401,11402,11403,11404,12981,13433,13434,13435,13436,13437,{"$f":"INDIRECT(CONCATENATE($BB$1,\"b$\",AS$2))","v":{"$error":"#REF!"}},{"$error":"#REF!"},{"$error":"#REF!"},{"$error":"#REF!"},{"$error":"#REF!"},{"$error":"#REF!"},{"$error":"#REF!"},{"$error":"#REF!"},{"$error":"#REF!"},{"$f":"INDIRECT(CONCATENATE($BB$1,\"b$\",BB$2))","v":{"$error":"#REF!"}},{"$f":"INDIRECT(CONCATENATE($BB$1,\"b$\",BC$2))","v":{"$error":"#REF!"}},{"$error":"#REF!"},{"$error":"#REF!"},{"$error":"#REF!"},{"$error":"#REF!"},{"$error":"#REF!"},{"$error":"#REF!"},{"$error":"#REF!"},{"$error":"#REF!"},{"$error":"#REF!"},{"$error":"#REF!"},{"$error":"#REF!"},{"$error":"#REF!"},{"$error":"#REF!"},{"$error":"#REF!"},{"$error":"#REF!"},{"$error":"#REF!"},{"$error":"#REF!"},{"$error":"#REF!"},{"$error":"#REF!"},{"$error":"#REF!"},{"$error":"#REF!"},{"$error":"#REF!"},{"$error":"#REF!"},{"$error":"#REF!"},{"$error":"#REF!"},{"$error":"#REF!"},{"$error":"#REF!"},{"$error":"#REF!"},{"$error":"#REF!"}]
[10,"1.","השקעות",null,null,null,null,null,null,78529191.0811508,3818.1966280040328,885633.51537797553,23587025.408525761,828167.67690903891,23604024.580000002,1229245.198451235,6473137.5500000007,1695670.5900000003,2661518.170203615,712596.96090484667,334447.34999999998,258342.5,123062.01,55752.912655153334,73220.045828764749,110228.48478638475,20384,233330.99,2464812.3510433156,993499.41027836292,1502057.4717361787,2077230.0229233557,916700.11547070788,46454.690576684217,127347.77574163729,244550.27277382114,1146476.9604066445,406632.1999292922,433962.04999999993,20314.79,272469.09000000003,54601.429999999993,64462.700000000004,90816.02,0,0,0,0,0,0,0,0,0,0,0,0,0,0,0,0,0,0,0,0,0,0,0,0,0,0,0,0,0,0,0,0,0,0,0,0,0,0,0,0,4777197.5900000008]
[11,null,"א.","מזומנים ושווי מזומנים",null,null,null,null,null,5764703.5199999996,171.05541253525666,53966.596772620011,1760832.1107674276,61824.847047417301,1762326.9600000002,98040.993772785514,360868.94999999995,91581.59,192294.07725997557,49654.730797413358,29638.52,21899.09,10671.7,3884.9392025866418,5839.8162272144709,7963.9827400244731,1815.55,14727.51,181477.05454914764,66659.736454112281,83239.113533342563,138975.56319415092,57229.992445897013,3420.3254508523605,8544.513545887723,13552.176466657425,76704.206805849084,25386.227554102989,104119.13,305.73,219.75,655.52,900.89,1064.1500000000001,0,0,0,0,0,0,0,0,0,0,0,0,0,0,0,0,0,0,0,0,0,0,0,0,0,0,0,0,0,0,0,0,0,0,0,0,0,0,0,0,474246.42]
[12,null,null,"(1","בישראל",null,null,null,null,5682169.6446504658,168.52591355468792,53168.560338122668,1734793.6302357407,60910.605952894621,1735044.5285487303,98040.993772785514,358073.16854292387,91349.309556577195,184820.35717840117,49654.730797413358,29638.52,21899.09,10661.091236462044,3884.9392025866418,5839.8162272144709,7963.9827400244731,1292.3835134311075,14727.51,177924.65868505964,65353.628749989235,82074.38053813127,135318.99289293555,56567.008633614736,3420.3254508523605,8544.513545887723,13552.176466657425,76704.206805849084,25386.227554102989,103445.02834342576,305.73,219.75,655.52,900.89,1064.1500000000001,0,0,0,0,0,0,0,0,0,0,0,0,0,0,0,0,0,0,0,0,0,0,0,0,0,0,0,0,0,0,0,0,0,0,0,0,0,0,0,0,468800.71322709764]
[13,null,null,null,"א)","יתרות מזומנים ועו\"ש בשקלים חדשים",null,null,null,3896702.38,111.34226465533689,35127.582409392773,1146149.2623057044,40242.623020247542,1230292.6000000001,51861.733499085007,261367.29,66321.13,109332.41768605306,44299.860767022263,13901.6,17915.46,8045.09,3465.979232977736,3089.146500914992,4528.0723139469601,1209.48,12733.95,128017.45568161824,48191.822632993157,62381.350104685422,101986.58608270687,45349.00948833469,2412.7643183817563,6177.2773670068409,10156.319895314571,56289.033917293142,20116.030511665314,92579.35,305.73,219.75,655.52,900.89,1064.1500000000001,null,null,null,null,null,null,null,null,null,null,null,null,null,null,null,null,null,null,null,null,null,null,null,null,null,null,null,null,null,null,null,null,null,null,null,null,null,null,null,null,269904.71999999997]
[14,null,null,null,"ב)","יתרות מזומנים ועו\"ש נקובים במט\"ח ",null,null,null,1491205.1146504662,42.680062349072934,13465.213879437817,439345.49138171022,15425.927116815441,478003.31854873005,38047.102612503084,78186.398542923911,20091.129556577194,70219.476280733958,2.4484366322237561,15452.61,0,2398.4812364620434,0.19156336777624394,2266.2773874969139,3217.7136376916542,58.883513431107531,1993.56,46653.103508013832,14494.415046526516,17025.759361874556,27304.863704136504,8214.270735236265,946.23062789817914,2025.3272493504378,2961.5976429141492,17088.41599464812,3937.7954524814554,10671.748343425756,null,null,null,null,null,null,null,null,null,null,null,null,null,null,null,null,null,null,null,null,null,null,null,null,null,null,null,null,null,null,null,null,null,null,null,null,null,null,null,null,null,null,null,null,null,161664.68322709767]
[15,null,null,null,"ג)","פח\"ק/פר\"י",null,null,null,294262.14999999997,14.503586550278104,4575.76404929208,149298.87654832602,5242.0558158316389,26748.61,8132.1576611974342,18519.48,4937.05,5268.4632116141411,5352.4215937588706,284.31,3983.63,217.52,418.76840624112924,484.39233880256461,218.19678838585909,24.02,null,3254.0994954275748,2667.3910704695559,2667.2710715712951,6027.5431060921746,3003.7284100437837,61.330504572425212,341.90892953044442,434.25892842870479,3326.7568939078246,1332.4015899562166,193.93,null,null,null,null,null,null,null,null,null,null,null,null,null,null,null,null,null,null,null,null,null,null,null,null,null,null,null,null,null,null,null,null,null,null,null,null,null,null,null,null,null,null,null,null,null,37231.31]
[16,null,null,null,"ד)","פק\"מ לתקופה של עד שלושה חודשים",null,null,null,0,0,0,0,0,null,0,null,null,0,0,null,null,null,0,0,0,null,null,0,0,0,0,0,0,0,0,0,0,null,null,null,null,null,null,null,null,null,null,null,null,null,null,null,null,null,null,null,null,null,null,null,null,null,null,null,null,null,null,null,null,null,null,null,null,null,null,null,null,null,null,null,null,null,null,0]
[17,null,null,null,"ה)","פיקדון צמוד מדד עד שלושה חודשים",null,null,null,0,0,0,0,0,null,0,null,null,0,0,null,null,null,0,0,0,null,null,0,0,0,0,0,0,0,0,0,0,null,null,null,null,null,null,null,null,null,null,null,null,null,null,null,null,null,null,null,null,null,null,null,null,null,null,null,null,null,null,null,null,null,null,null,null,null,null,null,null,null,null,null,null,null,null,0]
[18,null,null,null,"ו)","פיקדון צמוד מט\"ח עד שלושה חודשים (פצ\"מ)",null,null,null,0,0,0,0,0,null,0,null,null,0,0,null,null,null,0,0,0,null,null,0,0,0,0,0,0,0,0,0,0,null,null,null,null,null,null,null,null,null,null,null,null,null,null,null,null,null,null,null,null,null,null,null,null,null,null,null,null,null,null,null,null,null,null,null,null,null,null,null,null,null,null,null,null,null,null,0]
[19,null,null,null,"ז)","פיקדונות במט\"ח עד שלושה חודשים",null,null,null,0,0,0,0,0,null,0,null,null,0,0,null,null,null,0,0,0,null,null,0,0,0,0,0,0,0,0,0,0,null,null,null,null,null,null,null,null,null,null,null,null,null,null,null,null,null,null,null,null,null,null,null,null,null,null,null,null,null,null,null,null,null,null,null,null,null,null,null,null,null,null,null,null,null,null,0]
[20,null,null,"(2","בחו\"ל",null,null,null,null,82533.875349534108,2.5294989805687598,798.03643449733875,26038.480531686859,914.24109452267965,27282.431451269949,0,2795.781457076082,232.28044342280575,7473.7200815743972,0,0,0,10.608763537956859,0,0,0,523.16648656889242,0,3552.3958640879919,1306.1077041230456,1164.7329952112975,3656.570301215379,662.98381228227947,0,0,0,0,0,674.10165657424454,0,0,0,0,0,0,0,0,0,0,0,0,0,0,0,0,0,0,0,0,0,0,0,0,0,0,0,0,0,0,0,0,0,0,0,0,0,0,0,0,0,0,0,0,0,5445.7067729023438]
[21,null,null,null,"א)","יתרות מזומנים ועו\"ש נקובים במט\"ח",null,null,null,82533.875349534108,2.5294989805687598,798.03643449733875,26038.480531686859,914.24109452267965,27282.431451269949,null,2795.781457076082,232.28044342280575,7473.7200815743972,null,null,null,10.608763537956859,null,null,null,523.16648656889242,null,3552.3958640879919,1306.1077041230456,1164.7329952112975,3656.570301215379,662.98381228227947,null,null,null,null,null,674.10165657424454,null,null,null,null,null,null,null,null,null,null,null,null,null,null,null,null,null,null,null,null,null,null,null,null,null,null,null,null,null,null,null,null,null,null,null,null,null,null,null,null,null,null,null,null,null,5445.7067729023438]
[22,null,null,null,"ב)","פיקדונות במט\"ח עד שלושה חודשים",null,null,null,0,0,0,0,0,null,0,null,null,0,0,null,null,null,0,0,0,null,null,0,0,0,0,0,0,0,0,0,0,null,null,null,null,null,null,null,null,null,null,null,null,null,null,null,null,null,null,null,null,null,null,null,null,null,null,null,null,null,null,null,null,null,null,null,null,null,null,null,null,null,null,null,null,null,null,0]
[23,null,null,null,null,null,null,null,null,null,null,null,null,null,null,null,null,null,null,null,null,null,null,null,null,null,null,null,0,0,0,0,0,0,0,0,0,0,null,null,null,null,null,null,null,null,null,null,null,null,null,null,null,null,null,null,null,null,null,null,null,null,null,null,null,null,null,null,null,null,null,null,null,null,null,null,null,null,null,null,null,null,null,null,0]
[24,null,"ב.","ניירות ערך (למעט בחברות מוחזקות)",null,null,null,null,null,56510250.311087318,3141.4137281313429,676322.00379806897,16714810.472418437,586876.28114270023,16182572.309999999,759483.36879596265,4480849.3,1147101.1600000001,2465505.4768288825,652200.09133150033,281409.09999999998,236701.26,85105.680000000008,51027.518668499637,45238.661204037293,102110.49317111727,16368.73,218554.22999999998,1919333.5212970397,770466.08515433327,1106252.4592543063,1553136.3429919807,662637.92246549611,36173.968702960628,98759.134845666791,180109.18074569365,857216.10700801958,293934.63753450388,329055.27999999997,20009.060000000001,271596.13,53945.909999999996,63558.210000000006,95611.16,0,0,0,0,0,0,0,0,0,0,0,0,0,0,0,0,0,0,0,0,0,0,0,0,0,0,0,0,0,0,0,0,0,0,0,0,0,0,0,0,3493077.65]
[25,null,null,"(1","אגרות חוב ממשלתיות:",null,null,null,null,13160663.791087339,1845.5138576643442,267476.09398057958,3374910.4339597323,118496.99928936176,3049173.25,360029.85538448393,1439932.8699999999,431204.33999999997,355586.8616929024,649923.8892322199,6318.3,236432.04,111.67000000000002,50849.430767780104,21445.194615516106,14726.858307097629,230.24,0,375495.95110806858,204957.47956945293,385907.43457931903,351139.28772608505,242185.53581335049,7077.0288919314662,26271.660430547061,62829.665420680933,193802.85227391502,107429.2841866495,0,0,0,0,0,0,0,0,0,0,0,0,0,0,0,0,0,0,0,0,0,0,0,0,0,0,0,0,0,0,0,0,0,0,0,0,0,0,0,0,0,0,0,0,0,0,824873.7699999999]
[26,null,null,null,"א)","בישראל",null,null,null,13160663.791087339,1845.5138576643442,267476.09398057958,3374910.4339597323,118496.99928936176,3049173.25,360029.85538448393,1439932.8699999999,431204.33999999997,355586.8616929024,649923.8892322199,6318.3,236432.04,111.67000000000002,50849.430767780104,21445.194615516106,14726.858307097629,230.24,0,375495.95110806858,204957.47956945293,385907.43457931903,351139.28772608505,242185.53581335049,7077.0288919314662,26271.660430547061,62829.665420680933,193802.85227391502,107429.2841866495,0,0,0,0,0,0,0,0,0,0,0,0,0,0,0,0,0,0,0,0,0,0,0,0,0,0,0,0,0,0,0,0,0,0,0,0,0,0,0,0,0,0,0,0,0,0,824873.7699999999]
[27,null,null,null,null,"(1)","סחיר",null,null,12995105.470000001,327.85448028825402,103435.43227061759,3374910.4339597323,118496.99928936176,3049173.25,360029.85538448393,1439932.8699999999,431204.33999999997,355586.8616929024,649923.8892322199,6318.3,236432.04,111.67000000000002,50849.430767780104,21445.194615516106,14726.858307097629,230.24,0,375495.95110806858,204957.47956945293,385907.43457931903,351139.28772608505,242185.53581335049,7077.0288919314662,26271.660430547061,62829.665420680933,193802.85227391502,107429.2841866495,0,0,0,0,0,0,0,0,0,0,0,0,0,0,0,0,0,0,0,0,0,0,0,0,0,0,0,0,0,0,0,0,0,0,0,0,0,0,0,0,0,0,0,0,0,0,824873.7699999999]
[28,null,null,null,null,null,"(א)","     צמוד מדד",null,7092738.6400000006,138.49021101335003,43692.539534065108,1425608.2690689564,50054.751185965237,2680801.38,71170.118663684654,675733.29,231179.21,0,0,null,86170.4,74.180000000000007,0,4239.2513363153412,0,null,null,338040.85299801902,134004.82391200852,256572.55224251607,179366.34585995477,124370.44669973801,6371.1070019810195,17176.876087991492,41772.627757483897,98996.924140045259,55168.563300262009,null,null,null,null,null,null,null,null,null,null,null,null,null,null,null,null,null,null,null,null,null,null,null,null,null,null,null,null,null,null,null,null,null,null,null,null,null,null,null,null,null,null,null,null,null,null,572035.64]
[29,null,null,null,null,null,"(ג)","לא צמוד בריבית קבועה",null,3729686.0100000002,134.60771046878185,42467.642068075816,1385642.0877735321,48651.492447923447,307100.51,217954.02844066263,638619.67000000004,164202.6,26909.870429192055,9009.9778495291248,1325.55,106623.63,21.01,704.93215047087494,12982.441559337358,1114.4895708079478,171.46,null,27101.945539906683,54448.345145537154,118936.53871037019,134514.47378761641,97948.819979550186,510.79446009331781,6979.2448544628423,19364.081289629794,74242.016212383605,43448.390020449813,null,null,null,null,null,null,null,null,null,null,null,null,null,null,null,null,null,null,null,null,null,null,null,null,null,null,null,null,null,null,null,null,null,null,null,null,null,null,null,null,null,null,null,null,null,null,188555.36]
[30,null,null,null,null,null,"(ד)","לא צמוד בריבית משתנה",null,488255.07000000012,21.847508304035756,6892.7118625220382,224896.67875358849,7896.3818755854318,26819.62,34671.500504690208,59124.73,15028.35,3597.3052904750689,0,199.48,17878.57,3.29,0,2065.2094953097894,148.98470952493139,27.03,null,2983.646758990652,7892.279500274245,4913.1664093439476,18181.029637673098,9684.7248081351645,56.233241009348397,1011.640499725755,799.91359065605184,10034.580362326906,4295.9751918648381,null,null,null,null,null,null,null,null,null,null,null,null,null,null,null,null,null,null,null,null,null,null,null,null,null,null,null,null,null,null,null,null,null,null,null,null,null,null,null,null,null,null,null,null,null,null,29130.19]
[31,null,null,null,null,null,"(ה)","צמוד מט\"ח  ",null,0,0,0,0,0,null,0,null,null,0,0,null,null,null,0,0,0,null,null,0,0,0,0,0,0,0,0,0,0,null,null,null,null,null,null,null,null,null,null,null,null,null,null,null,null,null,null,null,null,null,null,null,null,null,null,null,null,null,null,null,null,null,null,null,null,null,null,null,null,null,null,null,null,null,null,0]
[32,null,null,null,null,null,"(ו)","מק\"מ",null,1684425.7500000002,32.909050502086373,10382.538805954644,338763.39836365561,11894.373779887643,34451.74,36234.207775446383,66455.179999999993,20794.18,325079.68597323529,640913.91138269077,4793.2700000000004,25759.439999999999,13.19,50144.498617309233,2158.2922245536165,13463.38402676475,31.75,null,7369.5058111522194,8612.0310116330274,5485.1772170888134,19077.43844084075,10181.544325927158,138.89418884778067,1103.8989883669726,893.0427829111868,10529.331559159251,4516.3556740728427,null,null,null,null,null,null,null,null,null,null,null,null,null,null,null,null,null,null,null,null,null,null,null,null,null,null,null,null,null,null,null,null,null,null,null,null,null,null,null,null,null,null,null,null,null,null,35152.58]
[33,null,null,null,null,"(2)","לא סחיר",null,null,165558.32108733809,1517.6593773760901,164040.66170996201,0,0,0,0,0,0,0,0,0,0,0,0,0,0,0,0,0,0,0,0,0,0,0,0,0,0,0,0,0,0,0,0,0,0,0,0,0,0,0,0,0,0,0,0,0,0,0,0,0,0,0,0,0,0,0,0,0,0,0,0,0,0,0,0,0,0,0,0,0,0,0,0,0]
[34,null,null,null,null,null,"(א)","אג\"ח מיועדות - הסכמי \"חץ\" כולל אג\"ח של חברת החשמל",null,165558.32108733809,1517.6593773760901,164040.66170996201,0,0,null,0,null,null,0,0,null,null,null,0,0,0,null,null,0,0,0,0,0,0,0,0,0,0,null,null,null,null,null,null,null,null,null,null,null,null,null,null,null,null,null,null,null,null,null,null,null,null,null,null,null,null,null,null,null,null,null,null,null,null,null,null,null,null,null,null,null,null,null,null,0]
[35,null,null,null,null,null,"(ב)","אג\"ח לא סחירות אחרות",null,0,0,0,0,0,null,0,null,null,0,0,null,null,null,0,0,0,null,null,0,0,0,0,0,0,0,0,0,0,null,null,null,null,null,null,null,null,null,null,null,null,null,null,null,null,null,null,null,null,null,null,null,null,null,null,null,null,null,null,null,null,null,null,null,null,null,null,null,null,null,null,null,null,null,null,0]
[36,null,null,null,"ב)","בחו\"ל",null,null,null,0,0,0,0,0,0,0,0,0,0,0,0,0,0,0,0,0,0,0,0,0,0,0,0,0,0,0,0,0,0,0,0,0,0,0,0,0,0,0,0,0,0,0,0,0,0,0,0,0,0,0,0,0,0,0,0,0,0,0,0,0,0,0,0,0,0,0,0,0,0,0,0,0,0,0,0]
[37,null,null,null,null,"(1)","סחיר",null,null,0,0,0,0,0,0,0,0,0,0,0,0,0,0,0,0,0,0,0,0,0,0,0,0,0,0,0,0,0,0,0,0,0,0,0,0,0,0,0,0,0,0,0,0,0,0,0,0,0,0,0,0,0,0,0,0,0,0,0,0,0,0,0,0,0,0,0,0,0,0,0,0,0,0,0,0]
[38,null,null,null,null,null,"(א)","ממשלת ישראל שהונפקו בחו\"ל ",null,0,0,0,0,0,null,0,null,null,0,0,null,null,null,0,0,0,null,null,0,0,0,0,0,0,0,0,0,0,null,null,null,null,null,null,null,null,null,null,null,null,null,null,null,null,null,null,null,null,null,null,null,null,null,null,null,null,null,null,null,null,null,null,null,null,null,null,null,null,null,null,null,null,null,null,0]
[39,null,null,null,null,null,"(ב)","שהנפיקה ממשלה זרה ",null,0,0,0,0,0,null,0,null,null,0,0,null,null,null,0,0,0,null,null,0,0,0,0,0,0,0,0,0,0,null,null,null,null,null,null,null,null,null,null,null,null,null,null,null,null,null,null,null,null,null,null,null,null,null,null,null,null,null,null,null,null,null,null,null,null,null,null,null,null,null,null,null,null,null,null,0]
{"$rows_left_out":503}
{"sheet":"גיליון2","index":1,"n_rows":0,"n_cols":0,"rows_kept":0,"cut":false,"hidden":false,"merged":[]}

{"sheet":"גיליון3","index":2,"n_rows":0,"n_cols":0,"rows_kept":0,"cut":false,"hidden":false,"merged":[]}