{"text_format":"1","workbook":"xlsx","n_sheets":3,"sheets":["גיליון1","גיליון2","גיליון3"],"not_rendered":{"charts":0,"images":1,"macros":0,"external_links":1,"defined_names":0,"comments":0,"pivot_tables":0},"unopened":[],"bounds":{"document_bytes":16777216,"sheet_cells":100000,"rows_first":2000,"rows_last":500,"rows_between":2000,"halvings":0,"cell_chars":16384,"cell_head_chars":4096},"cells_cut":0,"cells_raw":0,"read":"whole","date_system":"1900"}

{"sheet":"גיליון1","index":0,"n_rows":542,"n_cols":85,"rows_kept":542,"cut":false,"hidden":false,"merged":[[0,1,0,43],[6,9,9,9],[5,0,5,16383],[2,0,2,13],[1,11,1,33],[1,0,1,10]]}
[{"$f":"[1]הערות!A1","v":"V2.01"},{"$f":"[1]הערות!C2","v":"הראל חברה לביטוח בע\"מ"},null,null,null,null,null,null,null,null,null,null,null,null,null,null,null,null,null,null,null,null,null,null,null,null,null,null,null,null,null,null,null,null,null,null,null,null,null,null,null,null,null,null,null,null,null,null,null,null,null,null,null,"'נספחים ב וג'!$",null,null,null,null,null,null,null,null,null,null,null,null,null,null,null,null,null,null,null,null,null,null,null,null,null,null,null,null,null,null,"לא קיים מידע נוסף בשורה זו. המשך בשורה הבאה."]
["דו\"ח חודשי , שיעורי ההשקעות ורכוש קבוע מסך כל ההתחייבויות לתקופה שנסתיימה ביום - ",null,null,null,null,null,null,null,null,null,null,{"$f":"[1]הערות!C4","v":"31.1.22"},null,null,null,null,null,null,null,null,null,null,null,null,null,null,null,null,null,null,null,null,null,null,{"$f":"AJ2-1","v":50},51,52,53,54,55,56,57,58,59,60,61,62,63,64,65,66,67,{"$f":"BB2-1","v":68},69,{"$f":"BB2+1","v":70},{"$f":"BC2+1","v":71},72,73,74,75,76,77,78,79,80,81,82,83,84,85,86,87,88,89,90,91,92,93,94,95,96,97,98,99,"לא קיים מידע נוסף בשורה זו. המשך בשורה הבאה."]
[{"$f":"CONCATENATE([1]הערות!$G$103)","v":" הסכומים באלפי ש\"ח "},null,null,null,null,null,null,null,null,null,null,null,null,null,1,{"$f":"O3+1","v":2},{"$f":"P3+1","v":3},4,5,6,7,8,9,10,11,12,13,14,15,16,17,18,19,20,21,22,23,24,25,26,27,28,29,30,31,32,33,34,35,36,37,38,39,40,41,42,43,44,45,46,47,48,49,50,51,52,53,54,55,56,57,58,59,60,61,62,63,64,65,66,67,68,69,70,"לא קיים מידע נוסף בשורה זו. המשך בשורה הבאה."]
[]
[]
["גיליון זה הוא הגיליון היחיד בקובץ זה. גבולות הגיליון הם טור CG ושורה 496. גיליון זה מכיל טבלה המתחילה בתא A7 ומסתיימת בתא CG496. שורות 7 עד 10 מכילות את כותרות הטבלה. קיימים תאים ריקים בטבלה."]
[null,null,null,null,null,null,null,null,null,"סה\"כ משתתף ברווחים","ביטוח חיים "]
[null,null,null,null,null,null,null,null,null,null,10,11,12,13]
[null,null,null,null,null,null,null,null,"חזרה",null,{"$f":"'[1]נספחים ב וג'!$B$10","v":"קרן ח'"},{"$f":"'[1]נספחים ב וג'!$B$11","v":"קרן ט'"},{"$f":"'[1]נספחים ב וג'!$B$12","v":"קרן י'"},{"$f":"'[1]נספחים ב וג'!$B$13","v":"קרן י' פוליסות שהונפקו לאחר 1.1.04"},{"$f":"'[1]נספחים ב וג'!$C$30","v":"הראל-מסלול כללי"},{"$f":"'[1]נספחים ב וג'!$C$31","v":"הראל-מסלול אג\"ח ללא מניות"},{"$f":"'[1]נספחים ב וג'!$C$32","v":"הראל-מסלול אג\"ח עד 20% במניות"},{"$f":"'[1]נספחים ב וג'!$C$33","v":"הראל-מסלול אג\"ח עד 10% במניות"},{"$f":"'[1]נספחים ב וג'!$C$34","v":"הראל-מסלול מניות"},{"$f":"'[1]נספחים ב וג'!$C$35","v":"הראל-מסלול שקלי טווח קצר"},{"$f":"'[1]נספחים ב וג'!$C$36","v":"הראל-מסלול חו\"ל"},{"$f":"'[1]נספחים ב וג'!$C$37","v":"הראל - מסלול אג\"ח מדינת ישראל"},{"$f":"'[1]נספחים ב וג'!$C$38","v":"הראל - מסלול אג\"ח קונצרני"},{"$f":"'[1]נספחים ב וג'!$C$39","v":"הראל-מסלול משתתף ברווחים שקלי טווח קצר"},{"$f":"'[1]נספחים ב וג'!$C$40","v":"הראל-מסלול משתתף ברווחים כללי ללא מניות"},{"$f":"'[1]נספחים ב וג'!$C$41","v":"הראל-מסלול משתתף ברווחים לפחות 75% מניות"},{"$f":"'[1]נספחים ב וג'!$C$42","v":"הראל- אג\"ח חו\"ל"},{"$f":"'[1]נספחים ב וג'!$C$43","v":"הראל-מסלול פאסיבי - כללי"},{"$f":"'[1]נספחים ב וג'!$C$44","v":"הראל-מסלול לבני 50 ומטה"},{"$f":"'[1]נספחים ב וג'!$C$45","v":"הראל-מסלול לבני 50 עד 60"},{"$f":"'[1]נספחים ב וג'!$C$46","v":"הראל-מסלול לבני 60 ומעלה"},{"$f":"'[1]נספחים ב וג'!$C$47","v":"הראל-מסלול בסיסי למקבלי קצבה"},{"$f":"'[1]נספחים ב וג'!$C$48","v":"הראל-מסלול אג\"ח עד 20% במניות למקבלי קצבה"},"הראל חברה לביטוח בע\"מ מדרגות עד 50","הראל מסלול לגילאי 50 עד 60 ","הראל מסלול לגילאי 60 ומעלה","הראל מסלול בסיסי למקבלי קצבה","הראל מסלול אג\"ח עד 20% במניות למקבלי קצבה","הראל מסלול הוני ללא אג\"ח","הראל מחקה מדד ממשלתי שקלי ריבית קבועה","הראל מחקה מדד S&P 500","הראל מחקה מדד ממשלתי צמוד 5-10","הראל מחקה מדד תל בונד 60","הראל מחקה מדד ת\"א 35",{"$f":"INDIRECT(CONCATENATE($BB$1,\"C$\",AS$2))","v":{"$error":"#REF!"}},{"$error":"#REF!"},{"$error":"#REF!"},{"$error":"#REF!"},{"$error":"#REF!"},{"$error":"#REF!"},{"$error":"#REF!"},{"$error":"#REF!"},{"$error":"#REF!"},{"$f":"INDIRECT(CONCATENATE($BB$1,\"C$\",BB$2))","v":{"$error":"#REF!"}},{"$f":"INDIRECT(CONCATENATE($BB$1,\"C$\",BC$2))","v":{"$error":"#REF!"}},{"$error":"#REF!"},{"$error":"#REF!"},{"$error":"#REF!"},{"$error":"#REF!"},{"$error":"#REF!"},{"$error":"#REF!"},{"$error":"#REF!"},{"$error":"#REF!"},{"$error":"#REF!"},{"$error":"#REF!"},{"$error":"#REF!"},{"$error":"#REF!"},{"$error":"#REF!"},{"$error":"#REF!"},{"$error":"#REF!"},{"$error":"#REF!"},{"$error":"#REF!"},{"$error":"#REF!"},{"$error":"#REF!"},{"$error":"#REF!"},{"$error":"#REF!"},{"$error":"#REF!"},{"$error":"#REF!"},{"$error":"#REF!"},{"$error":"#REF!"},{"$error":"#REF!"},{"$error":"#REF!"},{"$error":"#REF!"},{"$error":"#REF!"},"אחר"]
["שורה",null,null,null,null,null,null,null,null,null,{"$f":"IF('[1]נספחים ב וג'!$N$10=0,0,CONCATENATE(VLOOKUP($B$1,[1]הערות!$D$89:$F$111,3,0),\"0\",K8))","v":"0010"},{"$f":"IF('[1]נספחים ב וג'!$N$11=0,0,CONCATENATE(VLOOKUP($B$1,[1]הערות!$D$89:$F$111,3,0),\"0\",L8))","v":"0011"},{"$f":"IF('[1]נספחים ב וג'!$N$12=0,0,CONCATENATE(VLOOKUP($B$1,[1]הערות!$D$89:$F$111,3,0),\"0\",M8))","v":"0012"},{"$f":"IF('[1]נספחים ב וג'!$N$13=0,0,CONCATENATE(VLOOKUP($B$1,[1]הערות!$D$89:$F$111,3,0),\"0\",N8))","v":"0013"},{"$f":"'[1]נספחים ב וג'!$B$30","v":88},{"$f":"'[1]נספחים ב וג'!$B$31","v":89},{"$f":"'[1]נספחים ב וג'!$B$32","v":90},{"$f":"'[1]נספחים ב וג'!$B$33","v":91},{"$f":"'[1]נספחים ב וג'!$B$34","v":92},{"$f":"'[1]נספחים ב וג'!$B$35","v":93},{"$f":"'[1]נספחים ב וג'!$B$36","v":163},{"$f":"'[1]נספחים ב וג'!$B$37","v":177},{"$f":"'[1]נספחים ב וג'!$B$38","v":178},{"$f":"'[1]נספחים ב וג'!$B$39","v":195},{"$f":"'[1]נספחים ב וג'!$B$40","v":196},{"$f":"'[1]נספחים ב וג'!$B$41","v":197},{"$f":"'[1]נספחים ב וג'!$B$42","v":8592},{"$f":"'[1]נספחים ב וג'!$B$43","v":9561},{"$f":"'[1]נספחים ב וג'!$B$44","v":9562},{"$f":"'[1]נספחים ב וג'!$B$45","v":9563},{"$f":"'[1]נספחים ב וג'!$B$46","v":9564},{"$f":"'[1]נספחים ב וג'!$B$47","v":9565},{"$f":"'[1]נספחים ב וג'!$B$48","v":9566},11400,11401,11402,11403,11404,12981,13433,13434,13435,13436,13437,{"$f":"INDIRECT(CONCATENATE($BB$1,\"b$\",AS$2))","v":{"$error":"#REF!"}},{"$error":"#REF!"},{"$error":"#REF!"},{"$error":"#REF!"},{"$error":"#REF!"},{"$error":"#REF!"},{"$error":"#REF!"},{"$error":"#REF!"},{"$error":"#REF!"},{"$f":"INDIRECT(CONCATENATE($BB$1,\"b$\",BB$2))","v":{"$error":"#REF!"}},{"$f":"INDIRECT(CONCATENATE($BB$1,\"b$\",BC$2))","v":{"$error":"#REF!"}},{"$error":"#REF!"},{"$error":"#REF!"},{"$error":"#REF!"},{"$error":"#REF!"},{"$error":"#REF!"},{"$error":"#REF!"},{"$error":"#REF!"},{"$error":"#REF!"},{"$error":"#REF!"},{"$error":"#REF!"},{"$error":"#REF!"},{"$error":"#REF!"},{"$error":"#REF!"},{"$error":"#REF!"},{"$error":"#REF!"},{"$error":"#REF!"},{"$error":"#REF!"},{"$error":"#REF!"},{"$error":"#REF!"},{"$error":"#REF!"},{"$error":"#REF!"},{"$error":"#REF!"},{"$error":"#REF!"},{"$error":"#REF!"},{"$error":"#REF!"},{"$error":"#REF!"},{"$error":"#REF!"},{"$error":"#REF!"},{"$error":"#REF!"}]
[10,"1.","השקעות",null,null,null,null,null,null,{"$f":"SUM(K11:CG11)","v":80254930.804737329},{"$f":"SUM(K12,K25,K393,K418,K455,K487,K495)","v":3964.8357464711485},928109.41756732692,24831656.939307619,804753.64122589957,24120106.880000003,1359963.2505247358,6536675.9699999988,1755473.3600000003,2575846.940970263,569860.8092940097,373655.92,293151.44000000006,132873.09999999998,44337.210435990419,76607.742985264253,106352.1423597376,24087.739999999998,252884.28,2405645.5188786648,874841.6445735317,1377663.8812749931,2084163.549603916,927474.47535130288,54310.621451335632,135052.06712646846,255121.42572500632,1057595.0042060839,390842.98612869717,473219.46000000008,19066.310000000001,196308.47000000003,52114.47,54199.29,52572.210000000006,0,0,0,0,0,0,0,0,0,0,0,0,0,0,0,0,0,0,0,0,0,0,0,0,0,0,0,0,0,0,0,0,0,0,0,0,0,0,0,0,5054377.8]
[{"$f":"A11+1","v":11},null,"א.","מזומנים ושווי מזומנים",null,null,null,null,null,{"$f":"SUM(K12:CG12)","v":4710593.17},{"$f":"SUM(K13,K21)","v":109.18029734368592},44641.987383521613,1424705.1734407519,46172.378878382886,1379788.89,58943.044400241735,301749.38,80057.039999999994,231840.38263127938,108168.00229903848,28128.39,15332.880000000001,7568.6100000000006,8415.8577009615365,3320.3055997582683,9572.2773687206118,1963.9199999999998,17433.86,152002.10200489426,39054.529032305894,54332.31917124649,122228.80273198544,40723.50487198944,3431.6479951057563,6028.9709676941065,10061.480828753511,62024.197268014555,17161.115128010562,154042.54,344.31,3504.64,968.3,971.46,900.74,0,0,0,0,0,0,0,0,0,0,0,0,0,0,0,0,0,0,0,0,0,0,0,0,0,0,0,0,0,0,{"$f":"SUM(BW13,BW21)","v":0},0,0,0,0,0,0,0,0,0,{"$f":"SUM(CG13,CG21)","v":274900.95}]
[12,null,null,"(1","בישראל",null,null,null,null,4710593.17,{"$f":"SUM(K14:K20)","v":109.18029734368592},44641.987383521613,1424705.1734407519,46172.378878382886,1379788.89,58943.044400241735,301749.38,80057.039999999994,231840.38263127938,108168.00229903848,28128.39,15332.880000000001,7568.6100000000006,8415.8577009615365,3320.3055997582683,9572.2773687206118,1963.9199999999998,17433.86,152002.10200489426,39054.529032305894,54332.31917124649,122228.80273198544,40723.50487198944,3431.6479951057563,6028.9709676941065,10061.480828753511,62024.197268014555,17161.115128010562,154042.54,344.31,3504.64,968.3,971.46,900.74,0,0,0,0,0,0,0,0,0,0,{"$f":"SUM(BC14:BC20)","v":0},0,0,0,0,0,0,0,0,0,0,0,0,0,0,0,0,0,0,0,0,0,0,0,0,0,0,0,0,0,{"$f":"SUM(CG14:CG20)","v":274900.95}]
[13,null,null,null,"א)","יתרות מזומנים ועו\"ש בשקלים חדשים",null,null,null,3365529.41,74.973259291309716,30655.304819772988,978333.93918871891,31706.212732216816,1019667.48,49773.227042892257,243808.13,67876.179999999993,144084.02660953547,63939.832219290656,12369.5,13513.76,6087.99,4974.7477807093528,2803.7629571077441,5948.9733904645254,927.01,15449.19,110336.69357109757,25539.064040372195,39006.674636307383,90744.575525188731,30871.433453168396,2490.9964289024347,3942.545959627807,7223.4153636926121,46047.734474811266,13009.396546831606,146038.38,344.31,3504.64,968.3,971.46,900.74,null,null,null,null,null,null,null,null,null,null,null,null,null,null,null,null,null,null,null,null,null,null,null,null,null,null,null,null,null,null,null,null,null,null,null,null,null,null,null,null,151594.81]
[14,null,null,null,"ב)","יתרות מזומנים ועו\"ש נקובים במט\"ח ",null,null,null,1020795.1300000001,23.913045311706465,9777.6420570310675,312043.84121675586,10112.833680901327,329230.21999999997,5320.2181484832172,43160.42,7466.08,66248.314818615137,2.3566446147825069,12694.86,null,971.1,0.18335538521749323,299.69185151678295,2735.2751813848599,971.81,1984.67,37670.801945511012,12137.626301347482,12310.433611775956,26709.056160975742,7696.1914310172551,850.46805448898647,1873.7236986525184,2279.6963882240439,13553.333839024259,3243.2185689827456,7830.31,null,null,null,null,null,null,null,null,null,null,null,null,null,null,null,null,null,null,null,null,null,null,null,null,null,null,null,null,null,null,null,null,null,null,null,null,null,null,null,null,null,null,null,null,null,91596.84]
[15,null,null,null,"ג)","פח\"ק/פר\"י",null,null,null,324268.63,10.293992740669731,4209.0405067175561,134327.39303527703,4353.3324652647425,30891.19,3849.5992088662588,14780.83,4714.78,21508.041203128774,44225.813435133037,3064.03,1819.12,509.52,3440.9265648669657,216.85079113374096,888.0287968712272,65.099999999999994,null,3994.6064882856649,1377.8386905862192,3015.2109231631466,4775.1710458209682,2155.8799878037898,90.183511714335154,212.70130941378071,558.36907683685342,2423.128954179032,908.50001219621049,173.85,null,null,null,null,null,null,null,null,null,null,null,null,null,null,null,null,null,null,null,null,null,null,null,null,null,null,null,null,null,null,null,null,null,null,null,null,null,null,null,null,null,null,null,null,null,31709.3]
[16,null,null,null,"ד)","פק\"מ לתקופה של עד שלושה חודשים",null,null,null,0,0,0,0,0,null,0,null,null,0,0,null,null,null,0,0,0,null,null,0,0,0,0,0,0,0,0,0,0,null,null,null,null,null,null,null,null,null,null,null,null,null,null,null,null,null,null,null,null,null,null,null,null,null,null,null,null,null,null,null,null,null,null,null,null,null,null,null,null,null,null,null,null,null,null,0]
[17,null,null,null,"ה)","פיקדון צמוד מדד עד שלושה חודשים",null,null,null,0,0,0,0,0,null,0,null,null,0,0,null,null,null,0,0,0,null,null,0,0,0,0,0,0,0,0,0,0,null,null,null,null,null,null,null,null,null,null,null,null,null,null,null,null,null,null,null,null,null,null,null,null,null,null,null,null,null,null,null,null,null,null,null,null,null,null,null,null,null,null,null,null,null,null,0]
[18,null,null,null,"ו)","פיקדון צמוד מט\"ח עד שלושה חודשים (פצ\"מ)",null,null,null,0,0,0,0,0,null,0,null,null,0,0,null,null,null,0,0,0,null,null,0,0,0,0,0,0,0,0,0,0,null,null,null,null,null,null,null,null,null,null,null,null,null,null,null,null,null,null,null,null,null,null,null,null,null,null,null,null,null,null,null,null,null,null,null,null,null,null,null,null,null,null,null,null,null,null,0]
[19,null,null,null,"ז)","פיקדונות במט\"ח עד שלושה חודשים",null,null,null,0,0,0,0,0,null,0,null,null,0,0,null,null,null,0,0,0,null,null,0,0,0,0,0,0,0,0,0,0,null,null,null,null,null,null,null,null,null,null,null,null,null,null,null,null,null,null,null,null,null,null,null,null,null,null,null,null,null,null,null,null,null,null,null,null,null,null,null,null,null,null,null,null,null,null,0]
[20,null,null,"(2","בחו\"ל",null,null,null,null,0,{"$f":"SUM(K22:K23)","v":0},{"$f":"SUM(L22:L23)","v":0},0,0,0,0,0,0,0,0,0,0,0,0,0,0,0,0,0,0,0,0,0,0,0,0,0,0,0,0,0,0,0,0,0,0,0,0,0,0,0,0,0,0,0,0,0,0,0,0,0,0,0,0,0,0,0,0,0,0,0,0,0,0,0,{"$f":"SUM(BX22:BX23)","v":0},0,0,0,0,0,0,0,0,{"$f":"SUM(CG22:CG23)","v":0}]
[21,null,null,null,"א)","יתרות מזומנים ועו\"ש נקובים במט\"ח",null,null,null,0,0,0,0,0,null,0,null,null,0,0,null,null,null,0,0,0,null,null,0,0,0,0,0,0,0,0,0,0,null,null,null,null,null,null,null,null,null,null,null,null,null,null,null,null,null,null,null,null,null,null,null,null,null,null,null,null,null,null,null,null,null,null,null,null,null,null,null,null,null,null,null,null,null,null,0]
[22,null,null,null,"ב)","פיקדונות במט\"ח עד שלושה חודשים",null,null,null,0,0,0,0,0,null,0,null,null,0,0,null,null,null,0,0,0,null,null,0,0,0,0,0,0,0,0,0,0,null,null,null,null,null,null,null,null,null,null,null,null,null,null,null,null,null,null,null,null,null,null,null,null,null,null,null,null,null,null,null,null,null,null,null,null,null,null,null,null,null,null,null,null,null,null,0]
[23,null,null,null,null,null,null,null,null,null,null,null,null,null,null,null,null,null,null,null,null,null,null,null,null,null,null,null,0,0,0,0,0,0,0,0,0,0,null,null,null,null,null,null,null,null,null,null,null,null,null,null,null,null,null,null,null,null,null,null,null,null,null,null,null,null,null,null,null,null,null,null,null,null,null,null,null,null,null,null,null,null,null,null,0]
[24,null,"ב.","ניירות ערך (למעט בחברות מוחזקות)",null,null,null,null,null,57791062.499447316,{"$f":"SUM(K26,K97,K156,K190,K198,K210,K218,K235,K176,K45,K281)","v":3393.6080670140459},{"$f":"SUM(L26,L97,L156,L190,L198,L210,L218,L235,L176,L45,L281)","v":700582.04971457575},17520647.54377979,567815.70788593136,16639640.540000001,912432.61130299803,4631459.33,1177353.4500000002,2279780.8215385526,442482.79495252069,315040.03999999998,278345.73000000004,96385.279999999999,34426.745047479337,51398.008697002078,94128.098461447677,20160.68,240022.25999999998,1859509.5877328725,687704.27026239643,1061836.0013380048,1611840.7005896515,691349.27704871236,41980.882267127978,106163.07973760369,196635.12866199488,817917.89941034815,291338.4929512876,310927.13,18734.57,191161.33000000002,52598.04,52811.57,48906.290000000008,0,0,0,0,0,0,0,0,0,0,0,0,0,0,0,0,0,0,0,0,0,0,0,0,0,0,0,0,0,0,0,{"$f":"SUM(BX26,BX97,BX156,BX190,BX198,BX210,BX218,BX235,BX176,BX45,BX281)","v":0},0,0,0,0,0,0,0,0,{"$f":"SUM(CG26,CG97,CG156,CG190,CG198,CG210,CG218,CG235,CG176,CG45,CG281)","v":3744152.95}]
[25,null,null,"(1","אגרות חוב ממשלתיות:",null,null,null,null,13448249.659447312,{"$f":"SUM(K27,K37)","v":2306.6649373756973},{"$f":"SUM(L27,L37)","v":256149.28427544778},3337012.4218042558,108147.1484302318,3093820.23,498176.73349340458,1593862.41,495503.30000000005,227781.04544921339,440743.41494237148,29032.43,278307.45,119.3,34291.41505762851,28062.666506595477,9404.6745507866235,610.26,0,374208.53853455512,192884.39662880611,402196.98855762929,427878.35144594195,271754.6179856697,8448.2514654449533,29776.173371193923,74480.481442370641,217124.03855405806,114518.93201433029,0,0,0,0,0,0,0,0,0,0,0,0,0,0,0,0,0,0,0,0,0,0,0,0,0,0,0,0,0,0,0,0,0,0,0,0,0,{"$f":"SUM(BX27,BX37)","v":0},0,0,0,0,0,0,0,0,{"$f":"SUM(CG27,CG37)","v":901648.04}]
[26,null,null,null,"א)","בישראל",null,null,null,13448249.659447312,{"$f":"SUM(K28,K35:K36)","v":2306.6649373756973},{"$f":"SUM(L28,L35:L36)","v":256149.28427544778},3337012.4218042558,108147.1484302318,3093820.23,498176.73349340458,1593862.41,495503.30000000005,227781.04544921339,440743.41494237148,29032.43,278307.45,119.3,34291.41505762851,28062.666506595477,9404.6745507866235,610.26,0,374208.53853455512,192884.39662880611,402196.98855762929,427878.35144594195,271754.6179856697,8448.2514654449533,29776.173371193923,74480.481442370641,217124.03855405806,114518.93201433029,0,0,0,0,0,0,0,0,0,0,0,0,0,0,0,0,0,0,0,0,0,0,0,0,0,0,0,0,0,0,0,0,0,0,0,0,0,{"$f":"SUM(BX28,BX35:BX36)","v":0},0,0,0,0,0,0,0,0,{"$f":"SUM(CG28,CG35:CG36)","v":901648.04}]
[27,null,null,null,null,"(1)","סחיר",null,null,13294612.030000001,{"$f":"SUM(K29:K33)","v":255.7273008086774},{"$f":"SUM(L29:L33)","v":104562.59246470379},3337012.4218042558,108147.1484302318,3093820.23,498176.73349340458,1593862.41,495503.30000000005,227781.04544921339,440743.41494237148,29032.43,278307.45,119.3,34291.41505762851,28062.666506595477,9404.6745507866235,610.26,0,374208.53853455512,192884.39662880611,402196.98855762929,427878.35144594195,271754.6179856697,8448.2514654449533,29776.173371193923,74480.481442370641,217124.03855405806,114518.93201433029,0,0,0,0,0,0,0,0,0,0,0,0,0,0,0,0,0,0,0,0,0,0,0,0,0,0,0,0,0,0,0,0,0,0,0,0,0,{"$f":"SUM(BX29:BX33)","v":0},0,0,0,0,0,0,0,0,{"$f":"SUM(CG29:CG33)","v":901648.04}]
[28,null,null,null,null,null,"(א)","     צמוד מדד",null,6613709.9000000004,87.937723694118617,35956.256276998349,1147508.5975744473,37188.888424860168,2592528.33,87616.686765810911,622764.87,243509.45,0,0,null,98248.66,79.45,0,4935.5132341890885,0,null,null,316044.4593600739,112361.0932384921,220853.15120519692,194359.42545487467,114958.9490895708,7135.1206399261446,17345.536761507898,40898.488794803081,98626.404545125333,48444.350910429195,null,null,null,null,null,null,null,null,null,null,null,null,null,null,null,null,null,null,null,null,null,null,null,null,null,null,null,null,null,null,null,null,null,null,null,null,null,null,null,null,null,null,null,null,null,null,572258.28]
[29,null,null,null,null,null,"(ג)","לא צמוד בריבית קבועה",null,4396333.1500000004,117.79025985249386,48162.456250544965,1537057.4790111948,49813.534478407848,361574.33,305923.91781620833,777462.66,197906.59,22682.893634214211,162.48786275073246,1545.36,125898.82,23.53,12.642137249267554,17232.922183791699,936.53636578579062,213.66,null,35612.08030274872,60673.110367442103,142964.12861045924,174791.12171948687,123931.80633183471,803.98969725127824,9366.2996325579043,26474.681389540739,88696.598280513121,52225.56366816529,null,null,null,null,null,null,null,null,null,null,null,null,null,null,null,null,null,null,null,null,null,null,null,null,null,null,null,null,null,null,null,null,null,null,null,null,null,null,null,null,null,null,null,null,null,null,234066.16]
[30,null,null,null,null,null,"(ד)","לא צמוד בריבית משתנה",null,841453.46000000008,24.738028883328159,10114.963964847599,322809.1385376926,10461.719468576472,48530.07,70725.812306684427,125344.92,27785.95,5212.7162117331654,0,348.78,30298.03,5.33,0,3984.0376933155744,215.2237882668347,48.39,null,6308.5951415031359,12988.425710084357,22191.362781433589,35640.290424111874,22186.615026131916,142.42485849686531,2005.0642899156433,4109.4872185664108,18085.429575888127,9349.5649738680859,null,null,null,null,null,null,null,null,null,null,null,null,null,null,null,null,null,null,null,null,null,null,null,null,null,null,null,null,null,null,null,null,null,null,null,null,null,null,null,null,null,null,null,null,null,null,52536.38]
[31,null,null,null,null,null,"(ה)","צמוד מט\"ח  ",null,0,0,0,0,0,null,0,null,null,0,0,null,null,null,0,0,0,null,null,0,0,0,0,0,0,0,0,0,0,null,null,null,null,null,null,null,null,null,null,null,null,null,null,null,null,null,null,null,null,null,null,null,null,null,null,null,null,null,null,null,null,null,null,null,null,null,null,null,null,null,null,null,null,null,null,0]
[32,null,null,null,null,null,"(ו)","מק\"מ",null,1443115.5199999998,25.261288378736765,10328.915972312889,329637.20668092108,10683.006058387309,91187.5,33910.316604700885,68289.960000000006,26301.31,199885.435603266,440580.92707962077,27138.29,23861.94,10.99,34278.772920379241,1910.1933952991135,8252.9143967339987,348.21,null,16243.403730229335,6861.7673127875223,16188.345960539589,23087.513847468523,10677.247538132275,366.7162697706645,1059.2726872124772,2997.8240394604095,11715.606152531482,4499.4524618677278,null,null,null,null,null,null,null,null,null,null,null,null,null,null,null,null,null,null,null,null,null,null,null,null,null,null,null,null,null,null,null,null,null,null,null,null,null,null,null,null,null,null,null,null,null,null,42787.22]
[33,null,null,null,null,"(2)","לא סחיר",null,null,153637.62944731102,{"$f":"SUM(K35:K36)","v":2050.93763656702},{"$f":"SUM(L35:L36)","v":151586.691810744},0,0,0,0,0,0,0,0,0,0,0,0,0,0,0,0,0,0,0,0,0,0,0,0,0,0,0,0,0,0,0,0,0,0,0,0,0,0,0,0,0,0,0,0,0,0,0,0,0,0,0,0,0,0,0,0,0,0,0,0,0,0,0,{"$f":"SUM(BX35:BX36)","v":0},0,0,0,0,0,0,0,0,{"$f":"SUM(CG35:CG36)","v":0}]
[34,null,null,null,null,null,"(א)","אג\"ח מיועדות - הסכמי \"חץ\" כולל אג\"ח של חברת החשמל",null,153637.62944731102,2050.93763656702,151586.691810744,0,0,null,0,null,null,0,0,null,null,null,0,0,0,null,null,0,0,0,0,0,0,0,0,0,0,null,null,null,null,null,null,null,null,null,null,null,null,null,null,null,null,null,null,null,null,null,null,null,null,null,null,null,null,null,null,null,null,null,null,null,null,null,null,null,null,null,null,null,null,null,null,0]
[35,null,null,null,null,null,"(ב)","אג\"ח לא סחירות אחרות",null,0,0,0,0,0,null,0,null,null,0,0,null,null,null,0,0,0,null,null,0,0,0,0,0,0,0,0,0,0,null,null,null,null,null,null,null,null,null,null,null,null,null,null,null,null,null,null,null,null,null,null,null,null,null,null,null,null,null,null,null,null,null,null,null,null,null,null,null,null,null,null,null,null,null,null,0]
[36,null,null,null,"ב)","בחו\"ל",null,null,null,0,{"$f":"SUM(K41,K38)","v":0},{"$f":"SUM(L41,L38)","v":0},0,0,0,0,0,0,0,0,0,0,0,0,0,0,0,0,0,0,0,0,0,0,0,0,0,0,0,0,0,0,0,0,0,0,0,0,0,0,0,0,0,0,0,0,0,0,0,0,0,0,0,0,0,0,0,0,0,0,0,0,0,0,0,{"$f":"SUM(BX41,BX38)","v":0},0,0,0,0,0,0,0,0,{"$f":"SUM(CG41,CG38)","v":0}]
[37,null,null,null,null,"(1)","סחיר",null,null,0,{"$f":"SUM(K39:K40)","v":0},{"$f":"SUM(L39:L40)","v":0},0,0,0,0,0,0,0,0,0,0,0,0,0,0,0,0,0,0,0,0,0,0,0,0,0,0,0,0,0,0,0,0,0,0,0,0,0,0,0,0,0,0,0,0,0,0,0,0,0,0,0,0,0,0,0,0,0,0,0,0,0,0,0,{"$f":"SUM(BX39:BX40)","v":0},0,0,0,0,0,0,0,0,{"$f":"SUM(CG39:CG40)","v":0}]
[38,null,null,null,null,null,"(א)","ממשלת ישראל שהונפקו בחו\"ל ",null,0,0,0,0,0,null,0,null,null,0,0,null,null,null,0,0,0,null,null,0,0,0,0,0,0,0,0,0,0,null,null,null,null,null,null,null,null,null,null,null,null,null,null,null,null,null,null,null,null,null,null,null,null,null,null,null,null,null,null,null,null,null,null,null,null,null,null,null,null,null,null,null,null,null,null,0]
[39,null,null,null,null,null,"(ב)","שהנפיקה ממשלה זרה ",null,0,0,0,0,0,null,0,null,null,0,0,null,null,null,0,0,0,null,null,0,0,0,0,0,0,0,0,0,0,null,null,null,null,null,null,null,null,null,null,null,null,null,null,null,null,null,null,null,null,null,null,null,null,null,null,null,null,null,null,null,null,null,null,null,null,null,null,null,null,null,null,null,null,null,null,0]
{"$rows_left_out":503}
{"sheet":"גיליון2","index":1,"n_rows":0,"n_cols":0,"rows_kept":0,"cut":false,"hidden":false,"merged":[]}

{"sheet":"גיליון3","index":2,"n_rows":0,"n_cols":0,"rows_kept":0,"cut":false,"hidden":false,"merged":[]}